Target
Aldo-keto reductase family 1 member C3
Ligand
BDBM50362836
Substrate
Meas. Tech.
ChEMBL_821641 (CHEMBL2038677)
Ki
680±n/a nM
Citation
 Endo, SMatsunaga, TKanamori, AOtsuji, YNagai, HSundaram, KEl-Kabbani, OToyooka, NOhta, SHara, A Selective inhibition of human type-5 17ß-hydroxysteroid dehydrogenase (AKR1C3) by baccharin, a component of Brazilian propolis. J Nat Prod 75:716-21 (2012)  
Target
Name:
Aldo-keto reductase family 1 member C3
Synonyms:
17-beta-Hydroxysteroid Dehydrogenase 5 (17-beta-HSD5, AKR1C3) AK1C3_HUMAN Aldo-keto reductase family 1 member C3 Aldo-keto reductase family 1 member C3 (AK1C3a) Aldo-keto-reductase family 1 member C3 Dihydrodiol dehydrogenase 3 Estradiol 17-beta-dehydrogenase KIAA0119 Prostaglandin F synthase Trans-1,2-dihydrobenzene-1,2-diol dehydrogenase
Type:
Enzyme
Mol. Mass.:
36859.86
Organism:
Homo sapiens (Human)
Description:
P42330
Residue:
323
  
Inhibitor
Name:
BDBM50362836
Synonyms:
ARTEPILLIN
Type:
Small organic molecule
Emp. Form.:
C19H24O3
Mol. Mass.:
300.3921
SMILES:
[#6]\[#6](-[#6])=[#6]/[#6]-c1cc(\[#6]=[#6]\[#6](-[#8])=O)cc(-[#6]\[#6]=[#6](\[#6])-[#6])c1-[#8]
: