Target
Peroxisome proliferator-activated receptor delta
Ligand
BDBM50194635
Substrate
Meas. Tech.
ChEMBL_822293 (CHEMBL2038596)
IC50
4±n/a nM
Citation
 Méndez-Lucio, OPérez-Villanueva, JCastillo, RMedina-Franco, JL Activity landscape modeling of PPAR ligands with dual-activity difference maps. Bioorg Med Chem 20:3523-32 (2012)  
Target
Name:
Peroxisome proliferator-activated receptor delta
Synonyms:
NR1C2 NUCI Nuclear receptor subfamily 1 group C member 2 PPAR-beta PPARD Peroxisome proliferator-activated receptor Peroxisome proliferator-activated receptor delta
Type:
Enzyme
Mol. Mass.:
49910.45
Organism:
Homo sapiens (Human)
Description:
Q03181
Residue:
441
  
Inhibitor
Name:
BDBM50194635
Synonyms:
(R)-3-{4-[3-(4-chloro-2-phenoxy-phenoxy)-butoxy]-2-methyl-phenyl}-propionic acid | CHEMBL214026
Type:
Small organic molecule
Emp. Form.:
C26H27ClO5
Mol. Mass.:
454.943
SMILES:
C[C@H](CCOc1ccc(CCC(O)=O)c(C)c1)Oc1ccc(Cl)cc1Oc1ccccc1
: