Target
Peroxisome proliferator-activated receptor delta
Ligand
BDBM50126018
Substrate
Meas. Tech.
ChEMBL_822293 (CHEMBL2038596)
IC50
4±n/a nM
Citation
 Méndez-Lucio, OPérez-Villanueva, JCastillo, RMedina-Franco, JL Activity landscape modeling of PPAR ligands with dual-activity difference maps. Bioorg Med Chem 20:3523-32 (2012)  
Target
Name:
Peroxisome proliferator-activated receptor delta
Synonyms:
NR1C2 NUCI Nuclear receptor subfamily 1 group C member 2 PPAR-beta PPARD Peroxisome proliferator-activated receptor Peroxisome proliferator-activated receptor delta
Type:
Enzyme
Mol. Mass.:
49910.45
Organism:
Homo sapiens (Human)
Description:
Q03181
Residue:
441
  
Inhibitor
Name:
BDBM50126018
Synonyms:
2-(3-chloro-4-(3-(7-propyl-3-(trifluoromethyl)benzo[d]isoxazol-6-yloxy)propylthio)phenyl)acetic acid {3-Chloro-4-[3-(7-propyl-3-trifluoromethyl-benzo[d]isoxazol-6-yloxy)-propylsulfanyl]-phenyl}-acetic acid | {3-chloro-4-[(3-{[7-propyl-3-(trifluoromethyl)-1,2-benzisoxazol-6-yl]oxy}propyl)sulfanyl]phenyl}acetic acid
Type:
Small organic molecule
Emp. Form.:
C22H21ClF3NO4S
Mol. Mass.:
487.92
SMILES:
CCCc1c(OCCCSc2ccc(CC(O)=O)cc2Cl)ccc2c(noc12)C(F)(F)F
: