Target
Peroxisome proliferator-activated receptor delta
Ligand
BDBM50227761
Substrate
Meas. Tech.
ChEMBL_822293 (CHEMBL2038596)
IC50
3±n/a nM
Citation
 Méndez-Lucio, OPérez-Villanueva, JCastillo, RMedina-Franco, JL Activity landscape modeling of PPAR ligands with dual-activity difference maps. Bioorg Med Chem 20:3523-32 (2012)  
Target
Name:
Peroxisome proliferator-activated receptor delta
Synonyms:
NR1C2 NUCI Nuclear receptor subfamily 1 group C member 2 PPAR-beta PPARD Peroxisome proliferator-activated receptor Peroxisome proliferator-activated receptor delta
Type:
Enzyme
Mol. Mass.:
49910.45
Organism:
Homo sapiens (Human)
Description:
Q03181
Residue:
441
  
Inhibitor
Name:
BDBM50227761
Synonyms:
2-(4-(3-fluoro-5-((2-fluoro-4-(trifluoromethyl)benzamido)methyl)phenoxy)-2-methylphenoxy)-2-methylpropanoic acid | CHEMBL392717
Type:
Small organic molecule
Emp. Form.:
C26H22F5NO5
Mol. Mass.:
523.4486
SMILES:
Cc1cc(Oc2cc(F)cc(CNC(=O)c3ccc(cc3F)C(F)(F)F)c2)ccc1OC(C)(C)C(O)=O
: