Target
Peroxisome proliferator-activated receptor delta
Ligand
BDBM50227765
Substrate
Meas. Tech.
ChEMBL_822293 (CHEMBL2038596)
IC50
3±n/a nM
Citation
 Méndez-Lucio, OPérez-Villanueva, JCastillo, RMedina-Franco, JL Activity landscape modeling of PPAR ligands with dual-activity difference maps. Bioorg Med Chem 20:3523-32 (2012)  
Target
Name:
Peroxisome proliferator-activated receptor delta
Synonyms:
NR1C2 NUCI Nuclear receptor subfamily 1 group C member 2 PPAR-beta PPARD Peroxisome proliferator-activated receptor Peroxisome proliferator-activated receptor delta
Type:
Enzyme
Mol. Mass.:
49910.45
Organism:
Homo sapiens (Human)
Description:
Q03181
Residue:
441
  
Inhibitor
Name:
BDBM50227765
Synonyms:
3-(4-(3-((5-chloro-3-methyl-1H-indole-2-carboxamido)methyl)phenoxy)-2-methylphenyl)propanoic acid | CHEMBL235143
Type:
Small organic molecule
Emp. Form.:
C27H25ClN2O4
Mol. Mass.:
476.951
SMILES:
Cc1c([nH]c2ccc(Cl)cc12)C(=O)NCc1cccc(Oc2ccc(CCC(O)=O)c(C)c2)c1
: