Target
Polymerase acidic protein
Ligand
BDBM50385514
Substrate
Meas. Tech.
ChEMBL_823233 (CHEMBL2040651)
Ki
8000±n/a nM
Citation
 Baughman, BMJake Slavish, PDuBois, RMBoyd, VAWhite, SWWebb, TR Identification of influenza endonuclease inhibitors using a novel fluorescence polarization assay. ACS Chem Biol 7:526-34 (2012)  
Target
Name:
Polymerase acidic protein
Synonyms:
Hepatitis C virus polyprotein PA/PB1 Polymerase acidic protein | RNA-directed RNA polymerase subunit P2
Type:
PROTEIN
Mol. Mass.:
82573.84
Organism:
Hepatitis C virus
Description:
ChEMBL_64976
Residue:
716
  
Inhibitor
Name:
BDBM50385514
Synonyms:
CHEMBL2040568
Type:
Small organic molecule
Emp. Form.:
C10H8N4O4
Mol. Mass.:
248.1949
SMILES:
COC(=O)c1nc([nH]c(=O)c1O)-c1cnccn1
: