Target
Muscarinic acetylcholine receptor M5
Ligand
BDBM50241132
Substrate
Meas. Tech.
ChEMBL_826082 (CHEMBL2045513)
Ki
0.209±n/a nM
Citation
 Del Bello, FBarocelli, EBertoni, SBonifazi, ACamalli, MCampi, GGiannella, MMatucci, RNesi, MPigini, MQuaglia, WPiergentili, A 1,4-dioxane, a suitable scaffold for the development of novel M3 muscarinic receptor antagonists. J Med Chem 55:1783-7 (2012)  
Target
Name:
Muscarinic acetylcholine receptor M5
Synonyms:
ACM5_HUMAN | CHRM5
Type:
PROTEIN
Mol. Mass.:
60102.35
Organism:
Homo sapiens (Human)
Description:
ChEMBL_1517990
Residue:
532
  
Inhibitor
Name:
BDBM50241132
Synonyms:
3-Hydroxy-2-phenyl-propionic acid 9-methyl-3-oxa-9-aza-tricyclo[3.3.1.0*2,4*]non-7-yl ester CHEMBL376897 Methyl scopolamine | N-METHYLSCOPOLAMINE
Type:
Small organic molecule
Emp. Form.:
C18H24NO4
Mol. Mass.:
318.3869
SMILES:
C[N+]1(C)[C@H]2C[C@@H](C[C@@H]1[C@H]1O[C@@H]21)OC(=O)[C@H](CO)c1ccccc1
: