Target
Nitric oxide synthase, endothelial
Ligand
BDBM50386379
Substrate
Meas. Tech.
ChEMBL_826805 (CHEMBL2051426)
IC50
37100±n/a nM
Citation
 Renton, PGreen, BMaddaford, SRakhit, SAndrews, JS NOpiates: Novel Dual Action Neuronal Nitric Oxide Synthase Inhibitors with µ-Opioid Agonist Activity. ACS Med Chem Lett 3:227-231 (2012)  
Target
Name:
Nitric oxide synthase, endothelial
Synonyms:
Constitutive NOS Endothelial NOS NOS type III NOS3_HUMAN Nitric oxide synthase (inducible and endothelial) Nitric-oxide synthase (endothelial and brain) eNOS
Type:
Enzyme Catalytic Domain
Mol. Mass.:
133297.84
Organism:
Homo sapiens (Human)
Description:
P29474
Residue:
1203
  
Inhibitor
Name:
BDBM50386379
Synonyms:
CHEMBL2048416
Type:
Small organic molecule
Emp. Form.:
C23H31N7O3
Mol. Mass.:
453.5373
SMILES:
CCOc1ccc(Cc2nc3cc(NC(N)=N[N+]([O-])=O)ccc3n2CCN(CC)CC)cc1
: