Target
Farnesyl pyrophosphate synthase
Ligand
BDBM12576
Substrate
Meas. Tech.
ChEMBL_826197 (CHEMBL2049638)
IC50
11±n/a nM
Citation
 Lin, YSPark, JDe Schutter, JWHuang, XFBerghuis, AMSebag, MTsantrizos, YS Design and synthesis of active site inhibitors of the human farnesyl pyrophosphate synthase: apoptosis and inhibition of ERK phosphorylation in multiple myeloma cells. J Med Chem 55:3201-15 (2012)  
Target
Name:
Farnesyl pyrophosphate synthase
Synonyms:
Dimethylallyltranstransferase FPP synthase FPPS_HUMAN Farnesyl diphosphate synthase Farnesyl diphosphate synthetase Farnesyl pyrophosphate synthetase KIAA1293 | P14324
Type:
Enzyme
Mol. Mass.:
48272.89
Organism:
Homo sapiens (Human)
Description:
P14324
Residue:
419
  
Inhibitor
Name:
BDBM12576
Synonyms:
Bisphosphonate 1 JMC515594 Compound 64 Risdronate [1-hydroxy-1-phosphono-2-(pyridin-3-yl)ethyl]phosphonic acid
Type:
Small organic molecule
Emp. Form.:
C7H11NO7P2
Mol. Mass.:
283.1123
SMILES:
OC(Cc1cccnc1)(P(O)(O)=O)P(O)(O)=O
: