Target
Voltage-dependent N-type calcium channel subunit alpha-1B
Ligand
BDBM50386813
Substrate
Meas. Tech.
ChEMBL_827319 (CHEMBL2050902)
IC50
41±n/a nM
Citation
 Beebe, XDarczak, DHenry, RFVortherms, TJanis, RNamovic, MDonnelly-Roberts, DKage, KLSurowy, CMilicic, INiforatos, WSwensen, AMarsh, KCWetter, JMFranklin, PBaker, SZhong, CSimler, GGomez, EBoyce-Rustay, JMZhu, CZStewart, AOJarvis, MFScott, VE Synthesis and SAR of 4-aminocyclopentapyrrolidines as N-type Ca²¿ channel blockers with analgesic activity. Bioorg Med Chem 20:4128-39 (2012)  
Target
Name:
Voltage-dependent N-type calcium channel subunit alpha-1B
Synonyms:
BIII Cach5 Cacnl1a5 Voltage-gated calcium channel subunit alpha Cav2.2 | calcium channel III
Type:
Enzyme Catalytic Domain
Mol. Mass.:
262310.63
Organism:
Rattus norvegicus (Rat)
Description:
Q02294
Residue:
2336
  
Inhibitor
Name:
BDBM50386813
Synonyms:
CHEMBL2047726
Type:
Small organic molecule
Emp. Form.:
C29H41F3N2O
Mol. Mass.:
490.6438
SMILES:
FC(F)(F)c1cccc(CN2C[C@@H]3CC[C@H](NC(=O)C(C4CCCCC4)C4CCCCC4)[C@@H]3C2)c1
: