Target
Calmodulin-domain protein kinase 1
Ligand
BDBM50180753
Substrate
Meas. Tech.
ChEMBL_830079 (CHEMBL2061832)
IC50
670±n/a nM
Citation
 Zhang, ZOjo, KKJohnson, SMLarson, ETHe, PGeiger, JACastellanos-Gonzalez, AWhite, ACParsons, MMerritt, EAMaly, DJVerlinde, CLVan Voorhis, WCFan, E Benzoylbenzimidazole-based selective inhibitors targeting Cryptosporidium parvum and Toxoplasma gondii calcium-dependent protein kinase-1. Bioorg Med Chem Lett 22:5264-7 (2012)  
Target
Name:
Calmodulin-domain protein kinase 1
Synonyms:
Calmodulin-domain protein kinase 1 Calmodulin-domain protein kinase, putative
Type:
Enzyme Catalytic Domain
Mol. Mass.:
57248.42
Organism:
Toxoplasma gondii
Description:
Residue:
507
  
Inhibitor
Name:
BDBM50180753
Synonyms:
(5-benzoyl-1H-benzimidazol-2-yl)-carbamic acid methyl ester MBDZ Vermox | methyl (5-benzoyl-1H-benzimidazol-2-yl)carbamate
Type:
Small organic molecule
Emp. Form.:
C16H13N3O3
Mol. Mass.:
295.2927
SMILES:
COC(=O)Nc1nc2ccc(cc2[nH]1)C(=O)c1ccccc1
: