Target
Dipeptidyl peptidase 4
Ligand
BDBM50206043
Substrate
Meas. Tech.
ChEMBL_829356 (CHEMBL2060147)
IC50
1.1±n/a nM
Citation
 Yoshida, TAkahoshi, FSakashita, HSonda, STakeuchi, MTanaka, YNabeno, MKishida, HMiyaguchi, IHayashi, Y Fused bicyclic heteroarylpiperazine-substituted L-prolylthiazolidines as highly potent DPP-4 inhibitors lacking the electrophilic nitrile group. Bioorg Med Chem 20:5033-41 (2012)  
Target
Name:
Dipeptidyl peptidase 4
Synonyms:
Bile canaliculus domain-specific membrane glycoprotein Cd26 DPP4_RAT Dipeptidyl peptidase 4 Dipeptidyl peptidase 4 60 kDa soluble form Dipeptidyl peptidase 4 soluble form Dipeptidyl peptidase IV 60 kDa soluble form Dipeptidyl peptidase IV soluble form GP110 glycoprotein | T-cell activation antigen CD26
Type:
Enzyme
Mol. Mass.:
88084.94
Organism:
Rattus norvegicus (rat)
Description:
Residue:
767
  
Inhibitor
Name:
BDBM50206043
Synonyms:
((2S,4S)-4-(4-(5-nitropyridin-2-yl)piperazin-1-yl)pyrrolidin-2-yl)(thiazolidin-3-yl)methanone | CHEMBL399610
Type:
Small organic molecule
Emp. Form.:
C17H24N6O3S
Mol. Mass.:
392.476
SMILES:
[O-][N+](=O)c1ccc(nc1)N1CCN(CC1)[C@@H]1CN[C@@H](C1)C(=O)N1CCSC1
: