Target
Carboxylic ester hydrolase
Ligand
BDBM50004000
Substrate
Meas. Tech.
ChEMBL_829364 (CHEMBL2060155)
IC50
58.4±n/a nM
Citation
 Shinada, MNarumi, FOsada, YMatsumoto, KYoshida, THiguchi, KKawasaki, TTanaka, HSatoh, M Synthesis of phenserine analogues and evaluation of their cholinesterase inhibitory activities. Bioorg Med Chem 20:4901-14 (2012)  
Target
Name:
Carboxylic ester hydrolase
Synonyms:
Acetylcholinesterase and butyrylcholinesterase (AChE and BChE) Butyrylcholinesterase (BuChE) | butyrylcholinesterase precursor
Type:
Enzyme
Mol. Mass.:
67776.22
Organism:
Rattus norvegicus (rat)
Description:
Residue:
597
  
Inhibitor
Name:
BDBM50004000
Synonyms:
(3aS,8aR)-1,3a,8-trimethyl-1,2,3,3a,8,8a-hexahydropyrrolo[2,3-b]indol-5-yl methylcarbamate CHEMBL94 Physostol | physostigmine
Type:
Small organic molecule
Emp. Form.:
C15H21N3O2
Mol. Mass.:
275.3461
SMILES:
CNC(=O)Oc1ccc2N(C)[C@H]3N(C)CC[C@@]3(C)c2c1
: