Target
Peptidyl-prolyl cis-trans isomerase FKBP1A
Ligand
BDBM50388300
Substrate
Meas. Tech.
ChEMBL_829708 (CHEMBL2061148)
IC50
3±n/a nM
Citation
 Gopalakrishnan, RKozany, CWang, YSchneider, SHoogeland, BBracher, AHausch, F Exploration of pipecolate sulfonamides as binders of the FK506-binding proteins 51 and 52. J Med Chem 55:4123-31 (2012)  
Target
Name:
Peptidyl-prolyl cis-trans isomerase FKBP1A
Synonyms:
12 kDa FK506-binding protein FK506-binding protein 1A FKB1A_HUMAN FKBP-1A FKBP12 Immunophilin FKBP12 PPIase FKBP1A Rotamase mTOR/FKBP12A/FKBP12B
Type:
Isomerase
Mol. Mass.:
11953.09
Organism:
Homo sapiens (Human)
Description:
P62942
Residue:
108
  
Inhibitor
Name:
BDBM50388300
Synonyms:
CHEMBL2058796
Type:
Small organic molecule
Emp. Form.:
C36H43N3O9S2
Mol. Mass.:
725.871
SMILES:
COc1ccc(CC[C@@H](OC(=O)[C@@H]2CCCCN2S(=O)(=O)c2ccc3[nH]c(=O)sc3c2)c2cccc(OCCN3CCOCC3)c2)cc1OC
: