Target
Glucose-6-phosphate 1-dehydrogenase
Ligand
BDBM50388491
Substrate
Meas. Tech.
ChEMBL_830111 (CHEMBL2061902)
IC50
4800±n/a nM
Citation
 Hamilton, NMDawson, MFairweather, EEHamilton, NSHitchin, JRJames, DIJones, SDJordan, AMLyons, AJSmall, HFThomson, GJWaddell, IDOgilvie, DJ Novel steroid inhibitors of glucose 6-phosphate dehydrogenase. J Med Chem 55:4431-45 (2012)  
Target
Name:
Glucose-6-phosphate 1-dehydrogenase
Synonyms:
G6PD Glucose 6-phosphate dehydrogenase (G6PD) glucose-6-phosphate 1-dehydrogenase isoform b
Type:
Enzyme
Mol. Mass.:
59258.58
Organism:
Homo sapiens (Human)
Description:
P11413
Residue:
515
  
Inhibitor
Name:
BDBM50388491
Synonyms:
CHEMBL2057307
Type:
Small organic molecule
Emp. Form.:
C22H37NO3S
Mol. Mass.:
395.599
SMILES:
CC(=O)[C@H]1CC[C@H]2[C@@H]3CC[C@H]4C[C@H](CC[C@]4(C)[C@H]3CC[C@]12C)NS(C)(=O)=O
: