Target
Casein kinase II subunit alpha
Ligand
BDBM50388788
Substrate
Meas. Tech.
ChEMBL_830890 (CHEMBL2065439)
IC50
4±n/a nM
Citation
 Dowling, JEChuaqui, CPontz, TWLyne, PDLarsen, NABlock, MHChen, HSu, NWu, ARussell, DPollard, HLee, JWPeng, BThakur, KYe, QZhang, TBrassil, PRacicot, VBao, LDenz, CRCooke, E Potent and Selective Inhibitors of CK2 Kinase Identified through Structure-Guided Hybridization. ACS Med Chem Lett 3:278-283 (2012)  
Target
Name:
Casein kinase II subunit alpha
Synonyms:
CK II CK2- alpha CSK21_HUMAN Casein kinase 2 Casein kinase II alpha/beta Casein kinase II subunit alpha (CK2A1) Casein kinase II subunit alpha (CK2a V66A) Casein kinase II subunit alpha (CK2a)
Type:
Enzyme
Mol. Mass.:
45151.12
Organism:
Homo sapiens (Human)
Description:
P68400
Residue:
391
  
Inhibitor
Name:
BDBM50388788
Synonyms:
CHEMBL2062566
Type:
Small organic molecule
Emp. Form.:
C20H19N7O
Mol. Mass.:
373.4112
SMILES:
CC(=O)Nc1ccc2CCN(c2c1)c1cc(NC2CC2)n2ncc(C#N)c2n1
: