Target
Cell division cycle 7-related protein kinase
Ligand
BDBM50388879
Substrate
Meas. Tech.
ChEMBL_830839 (CHEMBL2065345)
Ki
0.316228±n/a nM
Citation
 Milletti, FHermann, JC Targeted kinase selectivity from kinase profiling data. ACS Med Chem Lett 3:383-386 (2012)  
Target
Name:
Cell division cycle 7-related protein kinase
Synonyms:
CDC7 CDC7L1 Cell division cycle 7-related protein kinase (CDC7) huCdc7
Type:
Protein
Mol. Mass.:
63908.16
Organism:
Homo sapiens (Human)
Description:
O00311
Residue:
574
  
Inhibitor
Name:
BDBM50388879
Synonyms:
CHEMBL2062937
Type:
Small organic molecule
Emp. Form.:
C19H23ClN6
Mol. Mass.:
370.879
SMILES:
CN(C)[C@H]1CC[C@@H](CC1)Nc1nc(Cl)cc(n1)-c1c[nH]c2ncccc12
: