Target
4,4'-diapophytoene synthase
Ligand
BDBM50388907
Substrate
Meas. Tech.
ChEMBL_830992 (CHEMBL2065644)
IC50
>300000±n/a nM
Citation
 Zhang, YFu-Yang, LinLi, KZhu, WLiu, YLCao, RPang, RLee, EAxelson, JHensler, MWang, KMolohon, KJWang, YMitchell, DANizet, VOldfield, E HIV-1 Integrase Inhibitor-Inspired Antibacterials Targeting Isoprenoid Biosynthesis. ACS Med Chem Lett 3:402-406 (2012)  
Target
Name:
4,4'-diapophytoene synthase
Synonyms:
CRTM_STAAU crtM
Type:
PROTEIN
Mol. Mass.:
34309.10
Organism:
Staphylococcus aureus
Description:
ChEMBL_1352846
Residue:
287
  
Inhibitor
Name:
BDBM50388907
Synonyms:
CHEMBL2063257
Type:
Small organic molecule
Emp. Form.:
C23H31NO5
Mol. Mass.:
401.4959
SMILES:
CCCCCCCCCCOc1cccc(Cn2ccc(O)c(C(O)=O)c2=O)c1
: