Target
Prostaglandin G/H synthase 1
Ligand
BDBM50272862
Substrate
Meas. Tech.
ChEMBL_832832 (CHEMBL2066345)
IC50
1800±n/a nM
Citation
 Liedtke, AJCrews, BCDaniel, CMBlobaum, ALKingsley, PJGhebreselasie, KMarnett, LJ Cyclooxygenase-1-selective inhibitors based on the (E)-2'-des-methyl-sulindac sulfide scaffold. J Med Chem 55:2287-300 (2012)  
Target
Name:
Prostaglandin G/H synthase 1
Synonyms:
COX-1 Cyclooxygenase Cyclooxygenase-1 (COX-1) PTGS1 | Prostaglandin G/H synthase (cyclooxygenase)
Type:
Enzyme
Mol. Mass.:
68692.62
Organism:
Homo sapiens (Human)
Description:
P23219
Residue:
599
  
Inhibitor
Name:
BDBM50272862
Synonyms:
(E)-2'-des-methyl sulindac sulfide CHEMBL496464
Type:
Small organic molecule
Emp. Form.:
C19H15FO2S
Mol. Mass.:
326.385
SMILES:
CSc1ccc(\C=C2/C=C(CC(O)=O)c3cc(F)ccc23)cc1
: