Target
Potassium voltage-gated channel subfamily H member 2
Ligand
BDBM21398
Substrate
Meas. Tech.
ChEMBL_831501 (CHEMBL2066265)
IC50
230±n/a nM
Citation
 Pérez-Victoria, IMartín, JGonzález-Menéndez, Vde Pedro, NBills, GFOrtiz-López, FJEl Aouad, NGoetz, MAVicente, FPlatas, GGenilloud, OReyes, FTormo, JR Isolation and structural elucidation of cyclic tetrapeptides from Onychocola sclerotica. J Nat Prod 75:1210-4 (2012)  
Target
Name:
Potassium voltage-gated channel subfamily H member 2
Synonyms:
1,3-beta-glucan synthase component GLS2 ERG Eag-related protein 1 Ether-a-go-go-related gene (HERG) Ether-a-go-go-related gene potassium channel 1 Ether-a-go-go-related gene potassium channel 1 (hERG1) Ether-a-go-go-related protein 1 H-ERG KCNH2 Potassium voltage-gated channel subfamily H member 2 (hERG) Voltage-gated potassium channel subunit Kv11.1 hERG Potassium Channel 1 | putative potassium channel subunit
Type:
Multi-pass membrane protein
Mol. Mass.:
126672.65
Organism:
Homo sapiens (Human)
Description:
Q12809
Residue:
1159
  
Inhibitor
Name:
BDBM21398
Synonyms:
4-[4-(4-Chloro-phenyl)-4-hydroxy-piperidin-1-yl]-1-(4-fluoro-phenyl)-butan-1-one;propionate(HCl) CHEMBL54 Haloperidol | Haloperidol, 1
Type:
Small organic molecule
Emp. Form.:
C21H23ClFNO2
Mol. Mass.:
375.864
SMILES:
OC1(CCN(CCCC(=O)c2ccc(F)cc2)CC1)c1ccc(Cl)cc1
: