Target
Receptor-type tyrosine-protein kinase FLT3
Ligand
BDBM50389235
Substrate
Meas. Tech.
ChEMBL_831539 (CHEMBL2066303)
IC50
7±n/a nM
Citation
 Hsu, JTYeh, TKYen, SCChen, CTHsieh, SYHsu, TLu, CTChen, CHChou, LHChiu, CHChang, YITseng, YJYen, KRChao, YSLin, WHJiaang, WT 3-Phenyl-1H-5-pyrazolylamine-based derivatives as potent and efficacious inhibitors of FMS-like tyrosine kinase-3 (FLT3). Bioorg Med Chem Lett 22:4654-9 (2012)  
Target
Name:
Receptor-type tyrosine-protein kinase FLT3
Synonyms:
CD135 FL cytokine receptor FLK2 FLT3 Fetal liver kinase-2 Fms-like tyrosine kinase 3 (Flt-3) STK-1 Stem cell tyrosine kinase 1
Type:
Enzyme
Mol. Mass.:
112888.62
Organism:
Homo sapiens (Human)
Description:
P36888
Residue:
993
  
Inhibitor
Name:
BDBM50389235
Synonyms:
CHEMBL2063325
Type:
Small organic molecule
Emp. Form.:
C31H34N6O3
Mol. Mass.:
538.6401
SMILES:
CN1CCN(Cc2ccc(cc2)C(=O)Nc2cc(n[nH]2)-c2ccc(CNC(=O)OCc3ccccc3)cc2)CC1
: