Target
Vascular endothelial growth factor receptor 2
Ligand
BDBM21079
Substrate
Meas. Tech.
ChEMBL_831541 (CHEMBL2066305)
IC50
7±n/a nM
Citation
 Hsu, JTYeh, TKYen, SCChen, CTHsieh, SYHsu, TLu, CTChen, CHChou, LHChiu, CHChang, YITseng, YJYen, KRChao, YSLin, WHJiaang, WT 3-Phenyl-1H-5-pyrazolylamine-based derivatives as potent and efficacious inhibitors of FMS-like tyrosine kinase-3 (FLT3). Bioorg Med Chem Lett 22:4654-9 (2012)  
Target
Name:
Vascular endothelial growth factor receptor 2
Synonyms:
CD_antigen=CD309 Fetal liver kinase 1 (FLK-1) KDR Protein-tyrosine kinase receptor Flk-1 VEGFR-2 VEGFR2 Vascular Endothelial Growth Factor Receptor Kinase 2 Vascular endothelial growth factor receptor 2 (KDR) Vascular endothelial growth factor receptor 2 (VEGFR2) Vascular endothelial growth factor receptor-2 (VEGFR-2)
Type:
Receptor Tyrosine Kinase
Mol. Mass.:
151510.97
Organism:
Homo sapiens (Human)
Description:
P35968
Residue:
1356
  
Inhibitor
Name:
BDBM21079
Synonyms:
1-[4-(3-amino-1H-indazol-4-yl)phenyl]-3-(2-fluoro-5-methyl-phenyl)urea 1-[4-(3-azanyl-1H-indazol-4-yl)phenyl]-3-(2-fluoranyl-5-methyl-phenyl)urea ABT-869 CHEMBL223360 | cid_11485656
Type:
Small organic molecule
Emp. Form.:
C21H18FN5O
Mol. Mass.:
375.3989
SMILES:
Cc1ccc(F)c(NC(=O)Nc2ccc(cc2)-c2cccc3[nH]nc(N)c23)c1
: