Target
cAMP and cAMP-inhibited cGMP 3',5'-cyclic phosphodiesterase 10A
Ligand
BDBM31592
Substrate
Meas. Tech.
ChEMBL_834693 (CHEMBL2072669)
Ki
0.17±n/a nM
Citation
 Hu, EMa, JBiorn, CLester-Zeiner, DCho, RRumfelt, SKunz, RKNixey, TMichelsen, KMiller, SShi, JWong, JHill Della Puppa, GAble, JTalreja, SHwang, DRHitchcock, SAPorter, AImmke, DAllen, JRTreanor, JChen, H Rapid identification of a novel small molecule phosphodiesterase 10A (PDE10A) tracer. J Med Chem 55:4776-87 (2012)  
Target
Name:
cAMP and cAMP-inhibited cGMP 3',5'-cyclic phosphodiesterase 10A
Synonyms:
PDE10_RAT Phosphodiesterase 10 Phosphodiesterase Type 10 (PDE10A) | Rat recombinant PDE10a (rPDE10a)
Type:
Enzyme
Mol. Mass.:
90160.88
Organism:
Rattus norvegicus (rat)
Description:
PDE10A was generated from the full-length recombinant rat clone transfected into Sf9 cells.
Residue:
794
  
Inhibitor
Name:
BDBM31592
Synonyms:
PF-2545920 substituted pyrazole, 9
Type:
Small organic molecule
Emp. Form.:
C25H20N4O
Mol. Mass.:
392.4525
SMILES:
Cn1cc(c(n1)-c1ccc(OCc2ccc3ccccc3n2)cc1)-c1ccncc1
: