Target
Adenosine receptor A3
Ligand
BDBM50117108
Substrate
Meas. Tech.
ChEMBL_834863 (CHEMBL2073180)
Ki
0.01±n/a nM
Citation
 Baraldi, PGSaponaro, GRomagnoli, RAghazadeh Tabrizi, MBaraldi, SMoorman, ARCosconati, SDi Maro, SMarinelli, LGessi, SMerighi, SVarani, KBorea, PAPreti, D Water-soluble pyrazolo[4,3-e][1,2,4]triazolo[1,5-c]pyrimidines as human A3 adenosine receptor antagonists. J Med Chem 55:5380-90 (2012)  
Target
Name:
Adenosine receptor A3
Synonyms:
A3 adenosine receptor (hA3) ADORA3 | Adenosine A3 receptor (A3AR)
Type:
G Protein-Coupled Receptor (GPCR)
Mol. Mass.:
36197.32
Organism:
Homo sapiens (Human)
Description:
P0DMS8
Residue:
318
  
Inhibitor
Name:
BDBM50117108
Synonyms:
4-[3-(2-Furan-2-yl-8-methyl-8H-pyrazolo[4,3-e][1,2,4]triazolo[1,5-c]pyrimidin-5-yl)-ureido]-pyridinium; chloride CHEMBL118923
Type:
Small organic molecule
Emp. Form.:
C17H14N9O2
Mol. Mass.:
376.3516
SMILES:
Cn1cc2c(n1)nc(NC(=O)Nc1cc[nH+]cc1)n1nc(nc21)-c1ccco1
: