Target
ATP-binding cassette sub-family C member 2
Ligand
BDBM50390982
Substrate
Meas. Tech.
ChEMBL_839289 (CHEMBL2077960)
Ki
1010±n/a nM
Citation
 Akhteruzzaman, SKato, YHisaka, ASugiyama, Y Primary active transport of peptidic endothelin antagonists by rat hepatic canalicular membrane. J Pharmacol Exp Ther 288:575-81 (1999) Target
Name:
ATP-binding cassette sub-family C member 2
Synonyms:
ATP-binding cassette sub-family C member 2 Canalicular multidrug resistance protein Cmoat MRP2_RAT Multidrug resistance-associated protein 2
Type:
PROTEIN
Mol. Mass.:
173415.22
Organism:
Rattus norvegicus
Description:
ChEMBL_1455464
Residue:
1541
  
Inhibitor
Name:
BDBM50390982
Synonyms:
CHEMBL2075008
Type:
Small organic molecule
Emp. Form.:
C37H54N10O9
Mol. Mass.:
782.8863
SMILES:
CC(C)C[C@@H]1NC(=O)[C@H](NC(=O)[C@@H]2C[C@@H](CN2C(=O)[C@H](CC(O)=O)NC(=O)[C@@H](Cc2c[nH]c3ccccc23)NC1=O)OC(=O)C(N)CCCN=C(N)N)C(C)C
: