Target
ATP-dependent translocase ABCB1
Ligand
BDBM50027065
Substrate
Meas. Tech.
ChEMBL_838281 (CHEMBL2076229)
Ki
14250±n/a nM
Citation
 Ekins, SKim, RBLeake, BFDantzig, AHSchuetz, EGLan, LBYasuda, KShepard, RLWinter, MASchuetz, JDWikel, JHWrighton, SA Three-dimensional quantitative structure-activity relationships of inhibitors of P-glycoprotein. Mol Pharmacol 61:964-73 (2002)  
Target
Name:
ATP-dependent translocase ABCB1
Synonyms:
ABCB1 MDR1_HUMAN Multidrug resistance protein 1 P-glycoprotein (P-gp) PGY1
Type:
Protein
Mol. Mass.:
141503.50
Organism:
Homo sapiens (Human)
Description:
P08183
Residue:
1280
  
Inhibitor
Name:
BDBM50027065
Synonyms:
(5'alpha)-12'-hydroxy-2'-methyl-5'-(phenylmethyl)ergotoman-3',6',18-trione 12'-hydroxy-2'-methyl-5'alpha-(phenylmethyl)ergotaman-3',6',18-trione Ergotamin
Type:
Small organic molecule
Emp. Form.:
C33H35N5O5
Mol. Mass.:
581.6615
SMILES:
CN1C[C@@H](C=C2[C@H]1Cc1c[nH]c3cccc2c13)C(=O)N[C@]1(C)O[C@@]2(O)[C@@H]3CCCN3C(=O)[C@H](Cc3ccccc3)N2C1=O
: