Target
Solute carrier family 22 member 6
Ligand
BDBM50370587
Substrate
Meas. Tech.
ChEMBL_835925 (CHEMBL2077063)
Ki
450000±n/a nM
Citation
 Jariyawat, SSekine, TTakeda, MApiwattanakul, NKanai, YSophasan, SEndou, H The interaction and transport of beta-lactam antibiotics with the cloned rat renal organic anion transporter 1. J Pharmacol Exp Ther 290:672-7 (1999) Target
Name:
Solute carrier family 22 member 6
Synonyms:
Oat1 S22A6_RAT rOAT1 renal organic anion transporter 1
Type:
PROTEIN
Mol. Mass.:
60784.17
Organism:
Rattus norvegicus
Description:
ChEMBL_838479
Residue:
551
  
Inhibitor
Name:
BDBM50370587
Synonyms:
CEFAZOLIN
Type:
Small organic molecule
Emp. Form.:
C14H14N8O4S3
Mol. Mass.:
454.507
SMILES:
Cc1nnc(SCC2=C(N3[C@H](SC2)[C@H](NC(=O)Cn2cnnn2)C3=O)C(O)=O)s1
: