Target
Solute carrier organic anion transporter family member 1B1
Ligand
BDBM50370232
Substrate
Meas. Tech.
ChEMBL_836646 (CHEMBL2077488)
Ki
17000±n/a nM
Citation
 Vavricka, SRVan Montfoort, JHa, HRMeier, PJFattinger, K Interactions of rifamycin SV and rifampicin with organic anion uptake systems of human liver. Hepatology 36:164-72 (2002)  
Target
Name:
Solute carrier organic anion transporter family member 1B1
Synonyms:
LST1 OATP2 SLC21A6 SO1B1_HUMAN Solute carrier organic anion transporter family member 1B1 (OATP1B1) | Thromboxane B2
Type:
Protein
Mol. Mass.:
76468.06
Organism:
Homo sapiens (Human)
Description:
Q9Y6L6
Residue:
691
  
Inhibitor
Name:
BDBM50370232
Synonyms:
BA-41166E RIFAMPIN Rifampicin
Type:
Small organic molecule
Emp. Form.:
C43H58N4O12
Mol. Mass.:
822.9402
SMILES:
CO[C@H]1\C=C\O[C@@]2(C)Oc3c(C2=O)c2c(O)c(\C=N\N4CCN(C)CC4)c(NC(=O)\C(C)=C/C=C/[C@H](C)[C@H](O)[C@@H](C)[C@@H](O)[C@@H](C)[C@H](OC(C)=O)[C@@H]1C)c(O)c2c(O)c3C
: