Target
Solute carrier family 15 member 2
Ligand
BDBM50188504
Substrate
Meas. Tech.
ChEMBL_835961 (CHEMBL2077099)
Ki
18000±n/a nM
Citation
 Ramamoorthy, SLiu, WMa, YYYang-Feng, TLGanapathy, VLeibach, FH Proton/peptide cotransporter (PEPT 2) from human kidney: functional characterization and chromosomal localization. Biochim Biophys Acta 1240:1-4 (1996)  
Target
Name:
Solute carrier family 15 member 2
Synonyms:
Kidney H(+)/peptide cotransporter PEPT2 S15A2_HUMAN | SLC15A2
Type:
PROTEIN
Mol. Mass.:
81795.62
Organism:
Homo sapiens (Human)
Description:
ChEMBL_762551
Residue:
729
  
Inhibitor
Name:
BDBM50188504
Synonyms:
Ala-Asp | CHEMBL380047
Type:
Small organic molecule
Emp. Form.:
C7H12N2O5
Mol. Mass.:
204.1806
SMILES:
C[C@H](N)C(=O)N[C@@H](CC(O)=O)C(O)=O
: