Target
Solute carrier family 15 member 1
Ligand
BDBM50162073
Substrate
Meas. Tech.
ChEMBL_837975 (CHEMBL2075144)
IC50
3400000±n/a nM
Citation
 Han, Hde Vrueh, RLRhie, JKCovitz, KMSmith, PLLee, CPOh, DMSadée, WAmidon, GL 5'-Amino acid esters of antiviral nucleosides, acyclovir, and AZT are absorbed by the intestinal PEPT1 peptide transporter. Pharm Res 15:1154-9 (1998)  
Target
Name:
Solute carrier family 15 member 1
Synonyms:
Intestinal H(+)/peptide cotransporter Oligopeptide transporter, small intestine isoform Peptide transporter 1 SLC15A1
Type:
PROTEIN
Mol. Mass.:
78818.07
Organism:
Homo sapiens (Human)
Description:
ChEMBL_1488839
Residue:
708
  
Inhibitor
Name:
BDBM50162073
Synonyms:
(S)-2-((2-amino-6-oxo-3H-purin-9(6H)-yl)methoxy)ethyl 2-amino-3-methylbutanoate CHEMBL1349 | VALACYCLOVIR
Type:
Small organic molecule
Emp. Form.:
C13H20N6O4
Mol. Mass.:
324.3357
SMILES:
CC(C)[C@H](N)C(=O)OCCOCn1cnc2c1nc(N)[nH]c2=O
: