Target
Solute carrier family 22 member 8
Ligand
BDBM50036754
Substrate
Meas. Tech.
ChEMBL_836816 (CHEMBL2075341)
Ki
300000±n/a nM
Citation
 Motohashi, HUwai, YHiramoto, KOkuda, MInui, K Different transport properties between famotidine and cimetidine by human renal organic ion transporters (SLC22A). Eur J Pharmacol 503:25-30 (2004)  
Target
Name:
Solute carrier family 22 member 8
Synonyms:
OAT3 S22A8_HUMAN hOAT3
Type:
PROTEIN
Mol. Mass.:
59870.13
Organism:
Homo sapiens (Human)
Description:
ChEMBL_1486920
Residue:
542
  
Inhibitor
Name:
BDBM50036754
Synonyms:
(1Z)-N'-(aminosulfonyl)-3-[({2-[(diaminomethylene)amino]-1,3-thiazol-4-yl}methyl)thio]propanimidamide 3-(2-Guanidino-thiazol-4-ylmethylsulfanyl)-N-sulfonylamino-propionamidine FAMOTIDINE MK-208 N-sulfomoyl-3-(2-Guanidino-2H-1lambda*4*-thiazol-4-ylmethylsulfanyl)-propionamidine Pepcid ac Pepcid rpd
Type:
Small organic molecule
Emp. Form.:
C8H15N7O2S3
Mol. Mass.:
337.445
SMILES:
[#7]\[#6](-[#7])=[#7]/c1nc(-[#6]-[#16]-[#6]-[#6]-[#6](=[#7])-[#7]S([#7])(=O)=O)cs1
: