Target
Replicase polyprotein 1a
Ligand
BDBM50423877
Substrate
Meas. Tech.
ChEMBL_848934 (CHEMBL2149728)
Ki
11200±n/a nM
Citation
 Park, JYKim, JHKim, YMJeong, HJKim, DWPark, KHKwon, HJPark, SJLee, WSRyu, YB Tanshinones as selective and slow-binding inhibitors for SARS-CoV cysteine proteases. Bioorg Med Chem 20:5928-35 (2012)  
Target
Name:
Replicase polyprotein 1a
Synonyms:
3C-like proteinase 3CLp Growth factor-like peptide Non-structural protein 1 Non-structural protein 11 Non-structural protein 3 Non-structural protein 6 Non-structural protein 8 ORF1a polyprotein PL2-PRO Papain-like proteinase Replicase polyprotein 1a SARS coronavirus 3C-like proteinase nsp1 nsp11 nsp3 nsp5 nsp7 nsp9 pp1a
Type:
Enzyme
Mol. Mass.:
486353.36
Organism:
Human SARS coronavirus (SARS-CoV)
Description:
P0C6U8
Residue:
4382
  
Inhibitor
Name:
BDBM50423877
Synonyms:
DIHYDROTANSHINONE acs.jmedchem.1c00409_ST.562
Type:
Small organic molecule
Emp. Form.:
C18H14O3
Mol. Mass.:
278.302
SMILES:
C[C@H]1COC2=C1C(=O)C(=O)c1c2ccc2c(C)cccc12
: