Target
Dipeptidyl peptidase 4
Ligand
BDBM50391574
Substrate
Meas. Tech.
ChEMBL_850195 (CHEMBL2149801)
IC50
2.5±n/a nM
Citation
 Yoshida, TAkahoshi, FSakashita, HKitajima, HNakamura, MSonda, STakeuchi, MTanaka, YUeda, NSekiguchi, SIshige, TShima, KNabeno, MAbe, YAnabuki, JSoejima, AYoshida, KTakashina, YIshii, SKiuchi, SFukuda, STsutsumiuchi, RKosaka, KMurozono, TNakamaru, YUtsumi, HMasutomi, NKishida, HMiyaguchi, IHayashi, Y Discovery and preclinical profile of teneligliptin (3-[(2S,4S)-4-[4-(3-methyl-1-phenyl-1H-pyrazol-5-yl)piperazin-1-yl]pyrrolidin-2-ylcarbonyl]thiazolidine): a highly potent, selective, long-lasting and orally active dipeptidyl peptidase IV inhibitor for the treatment of type 2 diabetes. Bioorg Med Chem 20:5705-19 (2012)  
Target
Name:
Dipeptidyl peptidase 4
Synonyms:
Bile canaliculus domain-specific membrane glycoprotein Cd26 DPP4_RAT Dipeptidyl peptidase 4 Dipeptidyl peptidase 4 60 kDa soluble form Dipeptidyl peptidase 4 soluble form Dipeptidyl peptidase IV 60 kDa soluble form Dipeptidyl peptidase IV soluble form GP110 glycoprotein | T-cell activation antigen CD26
Type:
Enzyme
Mol. Mass.:
88084.94
Organism:
Rattus norvegicus (rat)
Description:
Residue:
767
  
Inhibitor
Name:
BDBM50391574
Synonyms:
CHEMBL2147710
Type:
Small organic molecule
Emp. Form.:
C23H28F3N5OS
Mol. Mass.:
479.562
SMILES:
FC(F)(F)c1cc(C2CCN(CC2)[C@@H]2CN[C@@H](C2)C(=O)N2CCSC2)n(n1)-c1ccccc1
: