Target
Angiotensin-converting enzyme
Ligand
BDBM50018849
Substrate
Meas. Tech.
ChEMBL_850741 (CHEMBL2156010)
Ki
1.5±n/a nM
Citation
 Mucha, AKafarski, PBerlicki, L Remarkable potential of thea-aminophosphonate/phosphinate structural motif in medicinal chemistry. J Med Chem 54:5955-80 (2011)  
Target
Name:
Angiotensin-converting enzyme
Synonyms:
ACE Angiotensin converting enzyme (ACE) Angiotensin-converting enzyme, soluble form CD_antigen=CD143 DCP1 Kininase II
Type:
Enzyme
Mol. Mass.:
149709.01
Organism:
Homo sapiens (Human)
Description:
Residue:
1306
  
Inhibitor
Name:
BDBM50018849
Synonyms:
4-Cyclohexyl-1-{2-[hydroxy-(4-phenyl-butyl)-phosphinoyl]-acetyl}-pyrrolidine-2-carboxylic acid FOSINOPRILAT
Type:
Small organic molecule
Emp. Form.:
C23H34NO5P
Mol. Mass.:
435.4935
SMILES:
OC(=O)[C@@H]1C[C@H](CN1C(=O)CP(O)(=O)CCCCc1ccccc1)C1CCCCC1
: