Target
Angiotensin-converting enzyme
Ligand
BDBM50393213
Substrate
Meas. Tech.
ChEMBL_850710 (CHEMBL2155979)
Ki
7±n/a nM
Citation
 Mucha, AKafarski, PBerlicki, L Remarkable potential of thea-aminophosphonate/phosphinate structural motif in medicinal chemistry. J Med Chem 54:5955-80 (2011)  
Target
Name:
Angiotensin-converting enzyme
Synonyms:
ACE Angiotensin converting enzyme (ACE) Angiotensin-converting enzyme, soluble form CD_antigen=CD143 DCP1 Kininase II
Type:
Enzyme
Mol. Mass.:
149709.01
Organism:
Homo sapiens (Human)
Description:
Residue:
1306
  
Inhibitor
Name:
BDBM50393213
Synonyms:
CHEMBL1235767
Type:
Small organic molecule
Emp. Form.:
C21H31N4O8P
Mol. Mass.:
498.4666
SMILES:
C[C@H](C[P@](O)(=O)[C@H](Cc1ccccc1)NC(=O)[C@H](CC(O)=O)NC(C)=O)C(=O)N[C@@H](C)C(N)=O
: