Target
Angiotensin-converting enzyme
Ligand
BDBM50303320
Substrate
Meas. Tech.
ChEMBL_850710 (CHEMBL2155979)
Ki
150±n/a nM
Citation
 Mucha, AKafarski, PBerlicki, L Remarkable potential of thea-aminophosphonate/phosphinate structural motif in medicinal chemistry. J Med Chem 54:5955-80 (2011)  
Target
Name:
Angiotensin-converting enzyme
Synonyms:
ACE Angiotensin converting enzyme (ACE) Angiotensin-converting enzyme, soluble form CD_antigen=CD143 DCP1 Kininase II
Type:
Enzyme
Mol. Mass.:
149709.01
Organism:
Homo sapiens (Human)
Description:
Residue:
1306
  
Inhibitor
Name:
BDBM50303320
Synonyms:
(S)-2-[(R)-3-[((R)-1-Benzyloxycarbonylamino-2-phenyl-ethyl)-hydroxy-phosphinoyl]-2-(3-phenyl-isoxazol-5-ylmethyl)-propionylamino]-3-(4-hydroxy-phenyl)-propionic acid | CHEMBL570953
Type:
Small organic molecule
Emp. Form.:
C38H38N3O9P
Mol. Mass.:
711.6968
SMILES:
OC(=O)[C@H](Cc1ccc(O)cc1)NC(=O)[C@@H](Cc1cc(no1)-c1ccccc1)CP(O)(=O)[C@H](Cc1ccccc1)NC(=O)OCc1ccccc1
: