Target
Low molecular weight phosphotyrosine protein phosphatase
Ligand
BDBM26658
Substrate
Meas. Tech.
ChEMBL_857178 (CHEMBL2163152)
IC50
10000±n/a nM
Citation
 Maccari, ROttanà, R Low molecular weight phosphotyrosine protein phosphatases as emerging targets for the design of novel therapeutic agents. J Med Chem 55:2-22 (2012)  
Target
Name:
Low molecular weight phosphotyrosine protein phosphatase
Synonyms:
ACP1 LMW-PTPase PPAC_BOVIN
Type:
PROTEIN
Mol. Mass.:
18055.33
Organism:
Bos taurus
Description:
ChEMBL_857178
Residue:
158
  
Inhibitor
Name:
BDBM26658
Synonyms:
2-(2,4-dihydroxyphenyl)-3,5,7-trihydroxy-1-benzopyran-4-one 2-(2,4-dihydroxyphenyl)-3,5,7-trihydroxy-chromone 2-[2,4-bis(oxidanyl)phenyl]-3,5,7-tris(oxidanyl)chromen-4-one MLS000069618 Morin (5) SMR000058259 morin
Type:
Flavonoid
Emp. Form.:
C15H10O7
Mol. Mass.:
302.2357
SMILES:
Oc1ccc(c(O)c1)-c1oc2cc(O)cc(O)c2c(=O)c1O
: