Target
Serine/threonine-protein kinase SMG1
Ligand
BDBM50394176
Substrate
Meas. Tech.
ChEMBL_856497 (CHEMBL2161543)
IC50
<0.050000±n/a nM
Citation
 Gopalsamy, ABennett, EMShi, MZhang, WGBard, JYu, K Identification of pyrimidine derivatives as hSMG-1 inhibitors. Bioorg Med Chem Lett 22:6636-41 (2012)  
Target
Name:
Serine/threonine-protein kinase SMG1
Synonyms:
61E3.4 KIAA0421 Lambda-interacting protein SMG-1 SMG1_HUMAN | hSMG-1
Type:
PROTEIN
Mol. Mass.:
410490.32
Organism:
Homo sapiens (Human)
Description:
ChEMBL_856497
Residue:
3661
  
Inhibitor
Name:
BDBM50394176
Synonyms:
CHEMBL2158861
Type:
Small organic molecule
Emp. Form.:
C26H27N7O3S
Mol. Mass.:
517.603
SMILES:
CNC(=O)Nc1ccc(cc1)-c1cc(ccn1)-c1ccnc(Nc2ccc(C)c(c2)S(=O)(=O)N(C)C)n1
: