Target
Serine/threonine-protein kinase SMG1
Ligand
BDBM50394170
Substrate
Meas. Tech.
ChEMBL_856497 (CHEMBL2161543)
IC50
330±n/a nM
Citation
 Gopalsamy, ABennett, EMShi, MZhang, WGBard, JYu, K Identification of pyrimidine derivatives as hSMG-1 inhibitors. Bioorg Med Chem Lett 22:6636-41 (2012)  
Target
Name:
Serine/threonine-protein kinase SMG1
Synonyms:
61E3.4 KIAA0421 Lambda-interacting protein SMG-1 SMG1_HUMAN | hSMG-1
Type:
PROTEIN
Mol. Mass.:
410490.32
Organism:
Homo sapiens (Human)
Description:
ChEMBL_856497
Residue:
3661
  
Inhibitor
Name:
BDBM50394170
Synonyms:
CHEMBL2158848
Type:
Small organic molecule
Emp. Form.:
C20H21N5O
Mol. Mass.:
347.4136
SMILES:
Cc1cccc(Nc2nccc(n2)-c2ccnc(c2)N2CCOCC2)c1
: