Target
ATP-citrate synthase
Ligand
BDBM50036210
Substrate
Meas. Tech.
ChEMBL_857791 (CHEMBL2169034)
Ki
150±n/a nM
Citation
 Abramson, HN The lipogenesis pathway as a cancer target. J Med Chem 54:5615-38 (2011)  
Target
Name:
ATP-citrate synthase
Synonyms:
ACLY_RAT | Acly
Type:
PROTEIN
Mol. Mass.:
120645.65
Organism:
Rattus norvegicus
Description:
ChEMBL_857791
Residue:
1100
  
Inhibitor
Name:
BDBM50036210
Synonyms:
(2S,3S)-3-Carboxy-2,3-dihydroxy-pentanedioic acid | CHEMBL118715
Type:
Small organic molecule
Emp. Form.:
C6H8O8
Mol. Mass.:
208.1229
SMILES:
O[C@H](C(O)=O)[C@@](O)(CC(O)=O)C(O)=O
: