Target
Potassium voltage-gated channel subfamily KQT member 2
Ligand
BDBM50395498
Substrate
Meas. Tech.
ChEMBL_858529 (CHEMBL2169533)
IC50
280±n/a nM
Citation
 Cheung, YYYu, HXu, KZou, BWu, MMcManus, OBLi, MLindsley, CWHopkins, CR Discovery of a series of 2-phenyl-N-(2-(pyrrolidin-1-yl)phenyl)acetamides as novel molecular switches that modulate modes of K(v)7.2 (KCNQ2) channel pharmacology: identification of (S)-2-phenyl-N-(2-(pyrrolidin-1-yl)phenyl)butanamide (ML252) as a potent, brain penetrant K(v)7.2 channel inhibitor. J Med Chem 55:6975-9 (2012)  
Target
Name:
Potassium voltage-gated channel subfamily KQT member 2
Synonyms:
KCNQ (Kv7) potassium channel KCNQ2_HUMAN Neuroblastoma-specific potassium channel subunit alpha KvLQT2 Voltage-gated potassium channel subunit Kv7.2
Type:
PROTEIN
Mol. Mass.:
95883.20
Organism:
Homo sapiens (Human)
Description:
ChEMBL_1457496
Residue:
872
  
Inhibitor
Name:
BDBM50395498
Synonyms:
CHEMBL2163662
Type:
Small organic molecule
Emp. Form.:
C20H23ClN2O
Mol. Mass.:
342.862
SMILES:
CCC(C(=O)Nc1ccccc1N1CCCC1)c1ccc(Cl)cc1
: