Target
Histamine H1 receptor
Ligand
BDBM50062614
Substrate
Meas. Tech.
ChEMBL_858531 (CHEMBL2169535)
IC50
162.18±n/a nM
Citation
 Vasudevan, SRMoore, JBSchymura, YChurchill, GC Shape-based reprofiling of FDA-approved drugs for the H1 histamine receptor. J Med Chem 55:7054-60 (2012)  
Target
Name:
Histamine H1 receptor
Synonyms:
HISTAMINE H1 Hrh1
Type:
Enzyme Catalytic Domain
Mol. Mass.:
55716.35
Organism:
RAT
Description:
HISTAMINE H1 HRH1 RAT::P31390
Residue:
486
  
Inhibitor
Name:
BDBM50062614
Synonyms:
CHEMBL900 Disipal N,N-dimethyl-2-(phenyl(o-tolyl)methoxy)ethanamine Norgesic Orphengesic
Type:
Small organic molecule
Emp. Form.:
C18H23NO
Mol. Mass.:
269.3813
SMILES:
CN(C)CCOC(c1ccccc1)c1ccccc1C
: