Target
DNA ligase
Ligand
BDBM50395801
Substrate
Meas. Tech.
ChEMBL_860483 (CHEMBL2166652)
IC50
2500±n/a nM
Citation
 Surivet, JPLange, RHubschwerlen, CKeck, WSpecklin, JLRitz, DBur, DLocher, HSeiler, PStrasser, DSPrade, LKohl, CSchmitt, CChapoux, GIlhan, EEkambaram, NAthanasiou, AKnezevic, ASabato, DChambovey, AGaertner, MEnderlin, MBoehme, MSippel, VWyss, P Structure-guided design, synthesis and biological evaluation of novel DNA ligase inhibitors with in vitro and in vivo anti-staphylococcal activity. Bioorg Med Chem Lett 22:6705-11 (2012)  
Target
Name:
DNA ligase
Synonyms:
DNLJ_STAAU lig | ligA
Type:
PROTEIN
Mol. Mass.:
75059.93
Organism:
Staphylococcus aureus
Description:
ChEMBL_1281598
Residue:
667
  
Inhibitor
Name:
BDBM50395801
Synonyms:
CHEMBL2165173
Type:
Small organic molecule
Emp. Form.:
C8H10N6O
Mol. Mass.:
206.2046
SMILES:
COc1nc2nc(N)nc(N)c2nc1C
: