Target
5-hydroxytryptamine receptor 2C
Ligand
BDBM50086062
Substrate
Meas. Tech.
ChEMBL_861531 (CHEMBL2174379)
IC50
10±n/a nM
Citation
 Calderón, FVidal-Mas, JBurrows, Jde la Rosa, JCJiménez-Díaz, MBMulet, TPrats, SSolana, JWitty, MGamo, FJFernández, E A Divergent SAR Study Allows Optimization of a Potent 5-HT2c Inhibitor to a Promising Antimalarial Scaffold. ACS Med Chem Lett 3:373-377 (2012)  
Target
Name:
5-hydroxytryptamine receptor 2C
Synonyms:
5-HT-2C 5-HT2C-INI 5-HTR2C 5-hydroxytryptamine receptor 2C (5-HT-2C) 5HT-1C HTR1C Serotonin (5-HT3) receptor Serotonin Receptor 2C
Type:
G Protein-Coupled Receptor (GPCR)
Mol. Mass.:
51836.79
Organism:
Homo sapiens (Human)
Description:
P28335
Residue:
458
  
Inhibitor
Name:
BDBM50086062
Synonyms:
5-Methoxy-6-trifluoromethyl-2,3-dihydro-indole-1-carboxylic acid (3-bromo-5-pyridin-3-yl-phenyl)-amide TCMDC-139024
Type:
Small organic molecule
Emp. Form.:
C22H17BrF3N3O2
Mol. Mass.:
492.288
SMILES:
COc1cc2CCN(C(=O)Nc3cc(Br)cc(c3)-c3cccnc3)c2cc1C(F)(F)F
: