Target
2-Hydroxyacid oxidase 2
Ligand
BDBM50396185
Substrate
Meas. Tech.
ChEMBL_863186 (CHEMBL2175910)
IC50
950±n/a nM
Citation
 Barawkar, DABandyopadhyay, ADeshpande, AKoul, SKandalkar, SPatil, PKhose, GVyas, SMone, MBhosale, SSingh, UDe, SMeru, AGundu, JChugh, APalle, VPMookhtiar, KAVacca, JPChakravarty, PKNargund, RPWright, SDRoy, SGraziano, MPCully, DCai, TQSingh, SB Discovery of pyrazole carboxylic acids as potent inhibitors of rat long chain L-2-hydroxy acid oxidase. Bioorg Med Chem Lett 22:4341-7 (2012)  
Target
Name:
2-Hydroxyacid oxidase 2
Synonyms:
(S)-2-hydroxy-acid oxidase, peroxisomal HAO2 HAOX2_HUMAN | Hydroxyacid oxidase 2
Type:
PROTEIN
Mol. Mass.:
38843.38
Organism:
Homo sapiens (Human)
Description:
ChEMBL_863186
Residue:
351
  
Inhibitor
Name:
BDBM50396185
Synonyms:
CHEMBL2172058
Type:
Small organic molecule
Emp. Form.:
C17H13FN2O2
Mol. Mass.:
296.2957
SMILES:
Cc1n[nH]c(C(O)=O)c1-c1cccc(c1)-c1ccc(F)cc1
: