Target
Aldo-keto reductase family 1 member C1
Ligand
BDBM50396739
Substrate
Meas. Tech.
ChEMBL_864307 (CHEMBL2175578)
Ki
31000±n/a nM
Citation
 Brožic, PTurk, SAdeniji, AOKonc, JJanežic, DPenning, TMLanišnik Rižner, TGobec, S Selective inhibitors of aldo-keto reductases AKR1C1 and AKR1C3 discovered by virtual screening of a fragment library. J Med Chem 55:7417-24 (2012)  
Target
Name:
Aldo-keto reductase family 1 member C1
Synonyms:
20-alpha-HSD AK1C1_HUMAN Aldo-keto reductase family 1 member C1 (AK1C1) Aldo-keto reductase family 1 member C1 (AKR1C1) DDH High-affinity hepatic bile acid-binding protein | Trans-1,2-dihydrobenzene-1,2-diol dehydrogenase
Type:
Enzyme
Mol. Mass.:
36793.97
Organism:
Homo sapiens (Human)
Description:
Recombinant AKR1C1 enzyme was expressed in E. coli.
Residue:
323
  
Inhibitor
Name:
BDBM50396739
Synonyms:
CHEMBL2172243
Type:
Small organic molecule
Emp. Form.:
C14H12N2O3
Mol. Mass.:
256.2567
SMILES:
NC(=O)c1ccccc1\N=C\c1cccc(O)c1O
: