Target
Aldo-keto reductase family 1 member C2
Ligand
BDBM50396749
Substrate
Meas. Tech.
ChEMBL_864310 (CHEMBL2175681)
Ki
102800±n/a nM
Citation
 Brožic, PTurk, SAdeniji, AOKonc, JJanežic, DPenning, TMLanišnik Rižner, TGobec, S Selective inhibitors of aldo-keto reductases AKR1C1 and AKR1C3 discovered by virtual screening of a fragment library. J Med Chem 55:7417-24 (2012)  
Target
Name:
Aldo-keto reductase family 1 member C2
Synonyms:
3-alpha-HSD3 AK1C2_HUMAN Aldo-keto reductase family 1 member C2 (AK1C2) Aldo-keto reductase family 1 member C2 (AKR1C2) DD-2 DDH2 Dihydrodiol dehydrogenase/bile acid-binding protein Type III 3-alpha-hydroxysteroid dehydrogenase
Type:
Enzyme
Mol. Mass.:
36739.89
Organism:
Homo sapiens (Human)
Description:
Residue:
323
  
Inhibitor
Name:
BDBM50396749
Synonyms:
CHEMBL2172258
Type:
Small organic molecule
Emp. Form.:
C11H10N2O4S
Mol. Mass.:
266.273
SMILES:
Oc1[nH]c(=O)sc1CC(=O)Nc1ccccc1O
: