Target
Methylated-DNA--protein-cysteine methyltransferase
Ligand
BDBM50397043
Substrate
Meas. Tech.
ChEMBL_863278 (CHEMBL2176221)
IC50
86±n/a nM
Citation
 Zhu, RSeow, HABaumann, RPIshiguro, KPenketh, PGShyam, KSartorelli, AC Design of a hypoxia-activated prodrug inhibitor of O6-alkylguanine-DNA alkyltransferase. Bioorg Med Chem Lett 22:6242-7 (2012)  
Target
Name:
Methylated-DNA--protein-cysteine methyltransferase
Synonyms:
6-O-methylguanine-DNA methyltransferase MGMT_HUMAN
Type:
PROTEIN
Mol. Mass.:
21651.27
Organism:
Homo sapiens (Human)
Description:
ChEMBL_144711
Residue:
207
  
Inhibitor
Name:
BDBM50397043
Synonyms:
CHEMBL2171202
Type:
Small organic molecule
Emp. Form.:
C15H16N6O2
Mol. Mass.:
312.3265
SMILES:
CC(=O)NCc1cccc(COc2nc(N)nc3nc[nH]c23)c1
: