Target
Pteridine reductase 1
Ligand
BDBM50398388
Substrate
Meas. Tech.
ChEMBL_876348 (CHEMBL2185822)
Ki
4170±n/a nM
Citation
 Corona, PGibellini, FCavalli, ASaxena, PCarta, ALoriga, MLuciani, RPaglietti, GGuerrieri, DNerini, EGupta, SHannaert, VMichels, PAFerrari, SCosti, PM Structure-based selectivity optimization of piperidine-pteridine derivatives as potent Leishmania pteridine reductase inhibitors. J Med Chem 55:8318-29 (2012)  
Target
Name:
Pteridine reductase 1
Synonyms:
HMTXR PTR1_LEIMA
Type:
PROTEIN
Mol. Mass.:
30459.34
Organism:
Leishmania major
Description:
ChEMBL_1470027
Residue:
288
  
Inhibitor
Name:
BDBM50398388
Synonyms:
CHEMBL2178604
Type:
Small organic molecule
Emp. Form.:
C20H22N8O3
Mol. Mass.:
422.4405
SMILES:
Nc1nc(N)c2nc(CNc3ccc(cc3)C(=O)N3CCC(CC3)C(O)=O)cnc2n1
: