Target
Beta-secretase 1
Ligand
BDBM50398472
Substrate
Meas. Tech.
ChEMBL_872756 (CHEMBL2185581)
Ki
0.036000±n/a nM
Citation
 Ghosh, AKVenkateswara Rao, KYadav, NDAnderson, DDGavande, NHuang, XTerzyan, STang, J Structure-based design of highly selectiveß-secretase inhibitors: synthesis, biological evaluation, and protein-ligand X-ray crystal structure. J Med Chem 55:9195-207 (2012)  
Target
Name:
Beta-secretase 1
Synonyms:
ASP2 Aspartyl protease 2 BACE1 Beta-secretase (BACE) Beta-secretase 1 (BACE 1) Beta-secretase 1 (BACE1) Beta-site amyloid precursor protein cleaving enzyme 1 Memapsin-2 beta-Secretase (BACE-1) | beta-Secretase (BACE1)
Type:
Protein
Mol. Mass.:
55755.10
Organism:
Homo sapiens (Human)
Description:
P56817
Residue:
501
  
Inhibitor
Name:
BDBM50398472
Synonyms:
CHEMBL2179138
Type:
Small organic molecule
Emp. Form.:
C35H51N5O5S
Mol. Mass.:
653.875
SMILES:
CCC[C@H](O)[C@H](NC[C@H](Cc1ccccc1)NC(=O)c1cc2N(C)S(=O)(=O)C(C)(C)Cn3cc(CC)c(c1)c23)C(=O)NCC(C)C
: